{"text_format":"1","workbook":"xlsx","n_sheets":10,"sheets":["Форма заказа","1. ФАСАД","2. ИНТЕРЬЕР","3. STOMIX","4. Базы","5. Ведра. Инструмент","6. Колоранты","7. Надбавки","8.Тарифы транспорта","Изменение прайс-листа"],"not_rendered":{"charts":0,"images":54,"macros":1,"external_links":1,"defined_names":13,"comments":0,"pivot_tables":0},"unopened":[],"bounds":{"document_bytes":16777216,"sheet_cells":100000,"rows_first":2000,"rows_last":500,"rows_between":2000,"halvings":0,"cell_chars":16384,"cell_head_chars":4096},"cells_cut":0,"cells_raw":0,"read":"whole","date_system":"1900"}

{"sheet":"Форма заказа","index":0,"n_rows":118,"n_cols":33,"rows_kept":118,"cut":false,"hidden":false,"merged":[[117,0,117,6],[13,4,13,6]]}
[]
[null,null,null,null,null,null,null,null,null,null,null,null,null,"Цвета"]
[null,"Заказ"]
[null,"Дата заявки",null,null,null,null,"Склад отгрузки"]
[null,"№ клиента"]
[null,"Компания",null,null,null,null,"Информация о доставке",null,null,null,null,null,null,"C01"]
[null,"Контакное лицо",null,null,null,null,null,null,null,null,null,null,null,"C02"]
[null,"Телефон",null,null,null,null,"Дата отгрузки",null,null,null,null,null,null,"C03"]
{"$rows_left_out":111}
{"sheet":"1. ФАСАД","index":1,"n_rows":312,"n_cols":26,"rows_kept":312,"cut":false,"hidden":false,"merged":[[310,25,311,25],[298,25,301,25],[302,25,303,25],[306,25,309,25],[251,25,252,25],[287,25,294,25],[285,25,286,25],[261,25,262,25],[263,25,264,25],[283,25,284,25],[271,25,272,25],[274,25,275,25],[278,25,279,25],[281,25,282,25],[276,25,277,25],[255,25,258,25],[51,25,52,25],[81,25,82,25],[102,25,104,25],[243,25,244,25],[253,25,254,25],[239,25,240,25],[200,25,201,25],[150,25,151,25],[194,25,199,25],[138,25,139,25],[136,25,137,25],[108,25,113,25],[126,25,133,25],[134,25,135,25],[114,25,115,25],[212,25,219,25],[267,25,268,25],[265,25,266,25],[233,25,234,25],[259,25,260,25],[245,25,246,25],[241,25,242,25],[247,25,250,25],[4,25,5,25],[2,25,3,25],[2,9,2,11],[2,14,3,14],[2,18,3,18],[2,19,3,19],[152,25,176,25],[2,0,3,0],[2,1,3,1],[2,3,3,3],[2,2,3,2],[35,25,36,25],[27,25,32,25],[14,25,15,25],[2,6,2,8],[2,13,3,13],[2,16,3,16],[2,17,3,17],[2,21,3,21],[105,25,106,25],[2,22,3,22],[2,23,3,23],[116,25,125,25],[186,25,193,25],[1,0,1,25],[178,25,183,25],[184,25,185,25],[58,25,66,25],[67,25,76,25],[2,12,3,12],[2,20,3,20],[2,15,3,15],[2,4,3,4],[2,5,3,5],[2,24,3,24],[16,25,17,25],[10,25,11,25],[88,25,89,25],[269,25,270,25],[33,25,34,25],[140,25,149,25],[237,25,238,25],[235,25,236,25],[210,25,211,25],[202,25,209,25],[48,25,50,25],[98,25,101,25],[96,25,97,25],[85,25,86,25],[226,25,227,25],[94,25,95,25],[228,25,230,25],[83,25,84,25],[220,25,225,25]]}
[]
["Прайс-лист  Товаров Продуктовой группы раздела «Фасад»\nЦены действительны c 03.03.2022 г."]
["Артикул ","Наименование продукта","Произ-водство","Область \nприменения","Вид материала","Основа материала","Упаковка",null,null,"Min \nрасход продукта",null,null,"Цена БЕЗ учета НДС за единицу измерения","Цена с НДС за единицу измерения","Цена с НДС за 1м² (при min расходе)","Цена с НДС за упаковку","Кол-во единиц товара","Сумма заказа с НДС","Итого вес брутто (кг)","Итого паллет","Наличие на складе","Рекомендованный ассортимент","Количество упаковок на паллете, шт.","Вес одного паллето-места (без палеты), кг.","Норма загрузки авто (20 т.) шт.","Краткое описание продукта"]
[null,null,null,null,null,null,"к-во","ед.","вид упаковки","от","до","единица измерения"]
["00861-002","StoPlex W ","DE","фасад","грунт проникающий","акрил-силоксан",20,"л","Канистра",0.1,0.4,"л/м²",{"$f":"VLOOKUP($A5,'Изменение прайс-листа'!$A$2:$E$798,4,FALSE)","v":540},{"$f":"M5*1.2","v":648},{"$f":"$N5*$J5","v":64.8},{"$f":"$N5*$G5","v":12960},null,{"$f":"Q5*P5","v":0},{"$f":"ROUNDUP(X5/W5*Q5,0)","v":0},{"$f":"Q5/W5","v":0},"●","●",24,498.72,792,"универсальная водоразбавимая грунтовка на акрилатной основе, усиленная силоксаном (гидрофобизирующий эффект). Разбавляется водой в соотношении 1:1"]
["00861-001","StoPlex W ","DE","фасад","грунт проникающий","акрил-силоксан",10,"л","Канистра",0.1,0.4,"л/м²",{"$f":"VLOOKUP($A6,'Изменение прайс-листа'!$A$2:$E$798,4,FALSE)","v":536},{"$f":"M6*1.2","v":643.19999999999993},{"$f":"$N6*$J6","v":64.319999999999993},{"$f":"$N6*$G6","v":6431.9999999999991},null,{"$f":"Q6*P6","v":0},{"$f":"ROUNDUP(X6/W6*Q6,0)","v":0},{"$f":"Q6/W6","v":0},"●",null,60,623.40000000000009,1740]
["00861_012","StoPrim Solid","RU","универсальный","грунт проникающий","акрил",5,"л","Канистра",0.02,0.08,"л/м²",{"$f":"VLOOKUP($A7,'Изменение прайс-листа'!$A$2:$E$798,4,FALSE)","v":566},679.19999999999993,13.584,3395.9999999999995,null,{"$f":"Q7*P7","v":0},0,0,"●","●",96,498.72,3168,"универсальная водорастворимая грунтовка - концентрат на основе акрилата с модифицирующими добавками. Разбавляется водой в соотношении 1:4. Глубоко проникает, хорошо укрепляет основание."]
["00810-015","StoPrim Micro","DE","фасад","грунт проникающий","силикон",3,"л","Канистра",0.01,0.05,"л/м²",{"$f":"VLOOKUP($A8,'Изменение прайс-листа'!$A$2:$E$798,4,FALSE)","v":14448},17337.599999999999,173.37599999999998,52012.799999999996,null,0,0,0,null,null,150,469.35,4950,"глубокопроникающий грунтовочный концентрат на основе силиконовой микроэмульсии, предназначен для проблемных оснований, разбавляется  водой 1:10"]
{"$rows_left_out":305}
{"sheet":"2. ИНТЕРЬЕР","index":2,"n_rows":254,"n_cols":29,"rows_kept":254,"cut":false,"hidden":false,"merged":[[187,28,188,28],[190,28,197,28],[178,28,179,28],[252,28,253,28],[249,28,250,28],[247,28,248,28],[205,28,206,28],[235,28,238,28],[232,28,234,28],[207,28,208,28],[209,28,212,28],[219,28,223,28],[229,28,230,28],[214,28,215,28],[245,28,246,28],[180,28,181,28],[183,28,186,28],[1,0,1,28],[2,0,3,0],[2,1,3,1],[2,17,3,17],[2,18,3,18],[2,23,3,23],[2,25,3,25],[2,26,3,26],[2,20,3,20],[2,16,3,16],[2,24,3,24],[2,19,3,19],[2,27,3,27],[2,28,3,28],[170,28,171,28],[81,28,86,28],[87,28,94,28],[155,28,156,28],[165,28,168,28],[172,28,173,28],[157,28,164,28],[149,28,154,28],[127,28,134,28],[103,28,110,28],[145,28,148,28],[141,28,144,28],[2,2,3,2],[2,3,3,3],[26,28,27,28],[46,28,49,28],[61,28,64,28],[34,28,39,28],[40,28,43,28],[44,28,45,28],[4,28,5,28],[2,4,3,4],[2,5,3,5],[2,9,2,11],[10,28,11,28],[2,15,3,15],[2,21,3,21],[2,22,3,22],[198,28,204,28],[2,12,2,14],[2,8,3,8],[2,6,3,6],[2,7,3,7],[14,28,17,28],[19,28,20,28],[29,28,30,28],[50,28,59,28],[139,28,140,28],[135,28,138,28],[73,28,80,28],[65,28,72,28],[95,28,102,28],[174,28,177,28],[111,28,118,28]]}
[]
["Прайс-лист  Товаров Продуктовой группы раздела «Интерьер»\nЦены действительны c 03.03.2022 г."]
["Артикул ","Наименование продукта","Производство","Область применения","Вид материала","Основа материала","Класс влажного истирания","Класс укрывистости","Степень матовости","Упаковка",null,null,"Min\nрасход продукта",null,null,"Цена БЕЗ учета НДС за единицу измерения","Цена с НДС за единицу измерения","Цена с НДС за 1м² (при min расходе)","Цена с НДС за упаковку","Кол-во единиц товара","Сумма заказа с НДС","Итого вес брутто (кг)","Итого паллет","Наличие на складе","Рекомендованный ассортимент","Количество упаковок на паллете, шт.","Вес одного паллето-места (без палеты), кг.","Норма загрузки авто (20 т.) шт.","Краткое описание продукта"]
[null,null,null,null,null,null,null,null,null,"к-во","ед.","вид упаковки","от","до","единица измерения"]
["00518-002","StoPrim Plex","DE","интерьер","грунт проникающий","акрил","н/д","н/д","н/д",20,"л","Канистра",0.1,0.4,"л/м²",{"$f":"VLOOKUP($A5,'Изменение прайс-листа'!$A$2:$E$798,4,FALSE)","v":620},{"$f":"P5*1.2","v":744},{"$f":"Q5*M5","v":74.400000000000006},{"$f":"Q5*J5","v":14880},null,{"$f":"T5*S5","v":0},{"$f":"ROUNDUP(AA5/Z5*T5,0)","v":0},{"$f":"T5/Z5","v":0},"●",null,24,498.72,792,"универсальная грунтовка на акрилатной основе, не содержит растворителей и пластификаторов"]
["00518-001","StoPrim Plex","DE","интерьер","грунт проникающий","акрил","н/д","н/д","н/д",10,"л","Канистра",0.1,0.4,"л/м²",{"$f":"VLOOKUP($A6,'Изменение прайс-листа'!$A$2:$E$798,4,FALSE)","v":612},{"$f":"P6*1.2","v":734.4},{"$f":"Q6*M6","v":73.44},{"$f":"Q6*J6","v":7344},null,{"$f":"T6*S6","v":0},{"$f":"ROUNDUP(AA6/Z6*T6,0)","v":0},{"$f":"T6/Z6","v":0},"●",null,60,623.40000000000009,1740]
["09609-001","StoPrim GT","DE","интерьер","грунт проникающий","акрил","н/д","н/д","н/д","15","л","Ведро",0.1,0.3,"л/м²",{"$f":"VLOOKUP($A7,'Изменение прайс-листа'!$A$2:$E$798,4,FALSE)","v":740},{"$f":"P7*1.2","v":888},{"$f":"Q7*M7","v":88.800000000000011},{"$f":"Q7*J7","v":13320},null,{"$f":"T7*S7","v":0},0,{"$f":"T7/Z7","v":0},"●","●",24,439.20000000000005,792,"Уникальный продукт! Проникающая грунтовка с технологией \"Гель-Технолоджи\", не капает, не образует подтеков. Идеальна для нанесения валиком! Идеальна для сложных поверхностей с \"косым\" светом"]
["00870-047","StoPrim Sol GT","DE","универсальный","грунт проникающий","силикат","н/д","н/д","н/д",15,"л","Ведро",0.1,0.2,"л/м²",{"$f":"VLOOKUP($A8,'Изменение прайс-листа'!$A$2:$E$798,4,FALSE)","v":720},864,86.4,12960,null,0,0,0,"●","●",24,439.20000000000005,792,"Уникальный продукт! водоразбавимая бесцветная грунтовка  на силикатной основе, идеальна для минеральных и органических оснований. Гелевая консистенция, минимизурующая образование капель"]
{"$rows_left_out":247}
{"sheet":"3. STOMIX","index":3,"n_rows":48,"n_cols":25,"rows_kept":48,"cut":false,"hidden":false,"merged":[[2,4,3,4],[2,16,3,16],[39,24,40,24],[41,24,42,24],[23,24,28,24],[2,20,3,20],[2,21,3,21],[2,22,3,22],[2,23,3,23],[37,24,38,24],[12,24,13,24],[29,24,30,24],[31,24,36,24],[16,24,17,24],[2,18,3,18],[2,19,3,19],[43,24,44,24],[45,24,46,24],[2,17,3,17],[2,24,3,24],[0,0,1,24],[2,0,3,0],[2,1,3,1],[2,5,3,5],[2,6,2,8],[2,9,2,11],[2,12,3,12],[2,13,3,13],[2,14,3,14],[2,15,3,15],[2,2,3,2],[2,3,3,3]]}
["Прайс-лист  Товаров Продуктовой группы раздела «Stomix»\nЦены действительны c 03.03.2022 г."]
[]
["Артикул","Наименование продукта","Произ-водство","Область применения","Вид материала","Цветовая гамма","Упаковка",null,null,"Min расход продукта",null,null,"Цена БЕЗ учета НДС за единицу измерения","Цена с НДС за единицу измерения","Цена с НДС за 1м² (при min расходе)","Цена с НДС за упаковку","Кол-во единиц товара","Сумма заказа с НДС","Итого вес брутто (кг)","Итого паллет","Наличие на складе","Количество упаковок на паллете, шт.","Вес одного паллето-места (без палеты), кг.","Норма загрузки авто (20 т.) шт.","Краткое описание продукта"]
[null,null,null,null,null,null,"кол-во","ед. изм.","вид упак.","от","до","ед. изм."]
["66502_001","Грунтовка проникающая универсальная EH концентрат","RU","фасад","Грунтовки",null,15,"кг","ведро",0.04,7.0000000000000007E-2,"кг/м²",{"$f":"VLOOKUP($A5,'Изменение прайс-листа'!$A$2:$E$798,4,FALSE)","v":560},{"$f":"M5*1.2","v":672},{"$f":"SUM(J5*N5)","v":26.88},{"$f":"N5*G5","v":10080},null,{"$f":"Q5*P5","v":0},{"$f":"ROUNDUP(W5/V5*Q5,0)","v":0},{"$f":"Q5/V5","v":0},"●",24,376.79999999999995,792,"воднодисперсионная  грунтовка для обработки сильновпитывающих оснований "]
["66301_001","Клеевой состав ALFAFIX S2","RU","фасад","Клей","серый",25,"кг","мешок",3,10,"кг/м²",{"$f":"VLOOKUP($A6,'Изменение прайс-листа'!$A$2:$E$798,4,FALSE)","v":38},45.6,136.80000000000001,1140,null,0,{"$f":"ROUNDUP(W6/V6*Q6,0)","v":0},{"$f":"Q6/V6","v":0},"●",42,1054.2,780,"клей минеральный для приклеивания теплоизоляционных плит"]
["66302_001","Клеевой и армирующий состав ALFAFIX S1","RU","фасад","Клей и армирующие массы","серый",25,"кг","мешок",3,10,"кг/м²",{"$f":"VLOOKUP($A7,'Изменение прайс-листа'!$A$2:$E$798,4,FALSE)","v":46},55.199999999999996,165.6,1380,null,0,0,0,"●",42,1054.2,780,"клей минеральный для создания базового армированного слоя и приклеивания теплоизоляционных плит"]
["66305_001","Клеевой и армирующий состав ALFAFIX S11","RU","фасад","Клей и армирующие массы","серый",25,"кг","мешок",2.7,10,"кг/м²",{"$f":"VLOOKUP($A8,'Изменение прайс-листа'!$A$2:$E$798,4,FALSE)","v":76},91.2,246.24000000000004,2280,null,0,0,0,null,42,1054.2,780,"клей минеральный эластичный  для создания базового слоя и приклеивания теплоизоляционных плит на нестабильные основания"]
{"$rows_left_out":41}
{"sheet":"4. Базы","index":4,"n_rows":153,"n_cols":16,"rows_kept":153,"cut":false,"hidden":false,"merged":[[1,12,2,12],[1,7,2,7],[1,8,2,8],[0,0,0,15],[1,15,2,15],[1,1,2,1],[1,2,1,4],[1,5,2,5],[1,13,2,13],[1,14,2,14],[1,6,2,6],[1,9,2,9],[1,0,2,0],[1,10,2,10],[1,11,2,11]]}
["Прайс-лист  Товаров Продуктовой группы раздела «Материалы для колерования» (Базы)\nЦены действительны c 03.03.2022 г."]
["Артикул ","Наименование продукта","Упаковка",null,null,"Цена БЕЗ учета НДС за единицу измерения","Цена с НДС за единицу измерения","Цена с НДС за упаковку","Кол-во единиц товара","Сумма заказа с НДС","Итого вес брутто (кг)","Итого паллет","Наличие на складе","Количество упаковок на паллете, шт.","Вес одного паллето-места (без палеты), кг.","норма загрузки авто (20 т.) шт."]
[null,null,"к-во","ед.","вид упаковки"]
["05374-053","PUTZGRUND OT ",22.5,"кг","Ведро",{"$f":"VLOOKUP($A4,'Изменение прайс-листа'!$A$2:$E$798,4,FALSE)","v":590},{"$f":"F4*1.2","v":708},{"$f":"G4*C4","v":15930},null,{"$f":"I4*H4","v":0},{"$f":"ROUNDUP(O4/N4*I4,0)","v":0},{"$f":"I4/N4","v":0},null,24,548.88,792]
["05374-051","PUTZGRUND HALBTITAN ",23,"кг","Ведро",{"$f":"VLOOKUP($A5,'Изменение прайс-листа'!$A$2:$E$798,4,FALSE)","v":546},655.19999999999993,15069.599999999999,null,{"$f":"I5*H5","v":0},{"$f":"ROUNDUP(O5/N5*I5,0)","v":0},{"$f":"I5/N5","v":0},"●",24,568.00800000000004,768]
["05825-012","STOLIT K 1,0 OT",25,"кг","Ведро",{"$f":"VLOOKUP($A6,'Изменение прайс-листа'!$A$2:$E$798,4,FALSE)","v":664},796.8,19920,null,0,0,0,null,24,616.20000000000005,696]
["05826-019","STOLIT K 1,5 O T",25,"кг","Ведро",{"$f":"VLOOKUP($A7,'Изменение прайс-листа'!$A$2:$E$798,4,FALSE)","v":586},703.19999999999993,17580,null,0,0,0,null,24,616.20000000000005,696]
["05827-019","STOLIT K 2,0 O T ",25,"кг","Ведро",{"$f":"VLOOKUP($A8,'Изменение прайс-листа'!$A$2:$E$798,4,FALSE)","v":596},715.19999999999993,17880,null,0,0,0,null,24,616.20000000000005,696]
{"$rows_left_out":146}
{"sheet":"5. Ведра. Инструмент","index":5,"n_rows":64,"n_cols":13,"rows_kept":64,"cut":false,"hidden":false,"merged":[[58,12,60,12],[26,12,28,12],[36,12,40,12],[41,12,42,12],[47,12,49,12],[55,12,56,12],[11,12,12,12],[14,12,15,12],[16,12,17,12],[19,12,21,12],[24,12,25,12],[3,12,8,12],[0,0,0,12],[1,0,2,0],[1,1,2,1],[1,3,1,4],[1,5,2,5],[1,6,2,6],[1,7,2,7],[1,12,2,12],[1,2,2,2],[1,8,2,8],[1,9,2,9],[1,10,2,10],[1,11,2,11]]}
["Прайс-лист  Товаров Продуктовой группы раздела «Профессиональный ручной инструмент»\nЦены действительны c 03.03.2022 г."]
["Артикул ","Наименование продукта","Вид материала","Упаковка",null,"фото","Цена руб/ед\nбез учета НДС","Цена руб/ед\nс учетом НДС","Кол-во единиц товара","Сумма заказа с НДС","Наличие на складе","Рекомендованный ассортимент","Краткое описание продукта"]
[null,null,null,"к-во","ед."]
["09679-188","Ведро желтое с логотипом Sto - 0,8 литра","Ведро","1","шт.",null,{"$f":"VLOOKUP($A4,'Изменение прайс-листа'!$A$2:$E$798,4,FALSE)","v":380},{"$f":"G4*1.2","v":456},null,{"$f":"I4*H4","v":0},"●","●","Ведро фирменное с логотипом Sto для образцов"]
["09257-002","Ведро желтое с логотипом Sto - 1,8 литра","Ведро","1","шт.",null,{"$f":"VLOOKUP($A5,'Изменение прайс-листа'!$A$2:$E$798,4,FALSE)","v":498},{"$f":"G5*1.2","v":597.6},null,{"$f":"I5*H5","v":0},"●","●"]
["09050-002","Ведро желтое с логотипом Sto - 3,2 литра","Ведро","1","шт.",null,{"$f":"VLOOKUP($A6,'Изменение прайс-листа'!$A$2:$E$798,4,FALSE)","v":530},{"$f":"G6*1.2","v":636},null,0,"●","●"]
["09049-002","Ведро желтое с логотипом Sto - 5,5 литра","Ведро","1","шт.",null,{"$f":"VLOOKUP($A7,'Изменение прайс-листа'!$A$2:$E$798,4,FALSE)","v":646},{"$f":"G7*1.2","v":775.19999999999993},null,0,"●","●"]
["09065-001","Ведро желтое с логотипом Sto - 12,0 литров","Ведро","1","шт.",null,"по запросу","по запросу",null,{"$f":"H8","v":"по запросу"},"●"]
{"$rows_left_out":57}
{"sheet":"6. Колоранты","index":6,"n_rows":24,"n_cols":17,"rows_kept":24,"cut":false,"hidden":false,"merged":[[0,0,0,16],[1,15,2,15],[1,0,2,0],[1,1,2,1],[1,2,2,2],[1,3,1,6],[1,7,2,7],[1,9,2,9],[1,16,2,16],[1,8,2,8],[1,11,2,11],[1,10,2,10],[1,14,2,14],[1,12,2,12],[1,13,2,13]]}
["Прайс-лист  Товаров Продуктовой группы раздела «Колоранты»\nЦены действительны c 03.03.2022 г."]
["Артикул ","Наименование продукта","Производство","Упаковка",null,null,null,"Цена БЕЗ учета НДС за единицу измерения","Цена с НДС за единицу измерения","Цена с НДС за упаковку","Кол-во единиц товара","Сумма заказа с НДС","Итого вес брутто (кг)","Итого паллет","Наличие на складе","Кол-во упаковок на паллете, шт.","Вес одного паллето-места (без палеты), кг."]
[null,null,null,"к-во","ед. изм.","литраж","вид упаковки"]
["06508-005","Sto-Colorant SBL","DE","4,577","кг",2.2999999999999998,"Ведро",{"$f":"VLOOKUP($A4,'Изменение прайс-листа'!$A$2:$E$798,4,FALSE)","v":11768},{"$f":"H4*1.2","v":14121.6},{"$f":"I4*D4","v":64634.563200000004},null,{"$f":"K4*J4","v":0},{"$f":"ROUNDUP(Q4/P4*K4,0)","v":0},{"$f":"K4/P4","v":0},"●",72,338.40000000000003]
["06516-007","Sto-Colorant OG ","DE","4,600","кг",2.2999999999999998,"Ведро",{"$f":"VLOOKUP($A5,'Изменение прайс-листа'!$A$2:$E$798,4,FALSE)","v":1920},2304,10598.4,null,{"$f":"K5*J5","v":0},{"$f":"ROUNDUP(Q5/P5*K5,0)","v":0},{"$f":"K5/P5","v":0},"●",72,345.59999999999997]
["06517-007","Colorant G2GXD","DE","2,714","кг",2.2999999999999998,"Ведро",{"$f":"VLOOKUP($A6,'Изменение прайс-листа'!$A$2:$E$798,4,FALSE)","v":6008},7209.5999999999995,19566.854399999997,null,{"$f":"K6*J6","v":0},0,0,"●",72,208.79999999999998]
["06523-005","Colorant PG ","DE","1,340","кг",1,"Банка",{"$f":"VLOOKUP($A7,'Изменение прайс-листа'!$A$2:$E$798,4,FALSE)","v":7778},9333.6,12507.024000000001,null,0,0,0,"●",270,405]
["06526-006","Sto-Colorant CGR","DE","5,980","кг",2.2999999999999998,"Ведро",{"$f":"VLOOKUP($A8,'Изменение прайс-листа'!$A$2:$E$798,4,FALSE)","v":4506},5407.2,32335.056,null,0,0,0,"●",72,439.2]
{"$rows_left_out":17}
{"sheet":"7. Надбавки","index":7,"n_rows":434,"n_cols":10,"rows_kept":434,"cut":false,"hidden":false,"merged":[[8,0,8,8],[0,0,0,8],[1,0,1,8],[2,0,3,0],[2,2,2,3],[2,4,2,5],[2,6,2,7],[2,1,3,1]]}
["Прайс-лист на надбавки за тонирование Товара\nЦены действительны c 03.03.2022 г."]
["Таблица надбавок к прайс-листу на колерованные материалы"]
["Продукты тонирования","ед изм","тонирование уровня С1\nфиксированная надбавка* к wiess/natur",null,"тонирование уровня С2\nфиксированная надбавка* к С1",null,"тонирование уровня С3\nфиксированная надбавка* к С1",null,"тонирование уровня С4"]
[null,null,"руб без НДС","руб с НДС","руб без НДС","руб с НДС","руб без НДС","руб с НДС"]
["декоративная штукатурка\nдекоративное покрытие\nшпатлевка\nгрунт адгезионный","кг",46,55.199999999999996,46,55.199999999999996,92,110.39999999999999,"         по запросу"]
["краска\nлазурь","л",74,88.8,74,88.8,148,177.6,"         по запросу"]
[]
["фиксированная надбавка, скидки не распространяются."]
{"$rows_left_out":427}
{"sheet":"8.Тарифы транспорта","index":8,"n_rows":44,"n_cols":8,"rows_kept":44,"cut":false,"hidden":false,"merged":[[14,1,15,1],[14,2,14,3],[14,4,14,5],[14,6,14,7],[7,2,7,3],[7,4,7,5],[7,6,7,7],[8,2,8,3],[8,4,8,5],[8,6,8,7],[9,2,9,3],[9,4,9,5],[9,6,9,7],[10,6,10,7],[11,6,11,7],[6,6,6,7],[3,2,3,3],[3,4,3,5],[3,6,3,7],[4,2,4,3],[4,4,4,5],[4,6,4,7],[5,2,5,3],[5,4,5,5],[5,6,5,7],[6,2,6,3],[6,4,6,5]]}
[null,null,"со склада Видное",null,"со склада Орёл",null,"со склада Германия"]
[]
[null,"Вознаграждение за транспортно-экспедиционные услуги ООО\"СТО\"\nдействительны с 03.03.2022"]
[null,null,"Транспортные услуги - поставки со склада г. Видное",null,"Транспортные услуги - поставки со склада г. Орёл",null,"Транспортные услуги - прямые поставки Германия (79+78) - регионы России"]
[null,null,"Стоимость указана при полной загрузке 20-тн машины\nСтавки указаны в руб. с НДС.",null,"Стоимость указана при полной загрузке 20-тн машины\nСтавки указаны в руб. с НДС.",null,"Стоимость указана при полной загрузке 20-тн машины\nСтавки указаны в евро с НДС"]
[null,null,"Условия и сроки поставки товара со склада Sto (Видное):",null,"Условия и сроки поставки товара со склада Sto (Видное):",null,"Условия и сроки поставки товара со склада Sto (Германия):"]
[null,null,"1. При заказе продукции больше текущего запаса на складе дозаказ/внутреннее перемещение согласовывается с Покупателем дополнительно.",null,"1. При заказе продукции больше текущего запаса на складе дозаказ/внутреннее перемещение согласовывается с Покупателем дополнительно.",null,"1. Размещение заказа в Германии - за 10-14 календарных дней до планируемой даты отгрузки"]
[null,null,"2. Отгрузка товаров через транспортные компании – в течение 3-х рабочих дней. ",null,"2. Отгрузка товаров через транспортные компании – в течение 3-х рабочих дней. ",null,"2. Отгрузка только полными 20-тн машинами"]
{"$rows_left_out":37}
{"sheet":"Изменение прайс-листа","index":9,"n_rows":798,"n_cols":5,"rows_kept":798,"cut":false,"hidden":false,"merged":[[1,2,2,2],[1,3,2,3],[1,0,3,0],[1,1,3,1],[1,4,3,4]]}
["Приложение 1 к письму об изменении Прайс-листа от 03.03.2022"]
["Артикул","Наименование продукта","прайс-лист \n07.02.2022","прайс-лист \n02.03.2022","изм\n%"]
[]
[null,null,"руб/ед без НДС","руб/ед без НДС"]
["66502_001","Грунтовка проникающая универсальная EH концентрат",484.5,560,{"$f":"D5/C5-1","v":0.15583075335397312}]
["66503_009","Грунтовка адгезионная HC-4, белая",192.85,195,1.114856105781703E-2]
["66301_001","Клеевой состав ALFAFIX S2",27.549999999999997,38,0.3793103448275863]
["66302_001","Клеевой и армирующий состав ALFAFIX S1",33.25,46,0.38345864661654128]
{"$rows_left_out":790}